{"text_format":"3","workbook":"xlsx","n_sheets":14,"sheets":["CAPTURA","CHEQUE CORTO","CHEQUE NVO","Orden sin recibo","orden con recibo","PAGARE","REGISTRO DE CHEQUES","CONCEPTO DE CHEQUE CHICO","PROVEEDORES","Transfer","Orden sin recibo TRANS","orden con recibo MODF","Hoja1","Hoja2"],"not_rendered":{"macros":1,"external_links":3,"defined_names":43,"comments":2},"read":"whole","date_system":"1900"}

{"sheet":"CAPTURA","index":0,"n_rows":18,"n_cols":3,"rows_kept":18}
[]
[]
[]
[null,"CHEQUE",1015]
[null,"FECHA","01 DE OCTUBRE DE 2018"]
[null,"NOMBRE","ARTEMIA LOPEZ MONTER"]
[null,"CANTIDAD",{"v":8008.04,"d":"8,008.04"}]
[null,"CONCEPTO","PAGO DE RENTA DEL MES DE OCTUBRE 2018 ( SAMAPA )"]
[null,"OBSERVACIONES"]
[null,"DEPARTAMENTO"]
[]
[]
[]
[]
[null,null,"                                                                      "]
[]
[]
[null,null," "]

{"sheet":"CHEQUE CORTO","index":1,"n_rows":25,"n_cols":3,"rows_kept":25,"merged":[[1,0,1,1],[2,0,2,3],[5,0,5,1],[16,0,16,1],[17,0,17,3],[20,0,20,1]]}
[" ",null,{"$f":"+CAPTURA!C5","v":"01 DE OCTUBRE DE 2018"}]
[{"$f":"+CAPTURA!C6","v":"ARTEMIA LOPEZ MONTER"},null,{"$f":"+CAPTURA!C7","v":{"v":8008.04,"d":"8,008.04"}}]
[{"$f":"PesosMN(C2)","v":"( OCHO MIL OCHO PESOS 04/100 M.N.)"}]
[" "]
[null,"  "]
[{"$f":"+CAPTURA!C8","v":"PAGO DE RENTA DEL MES DE OCTUBRE 2018 ( SAMAPA )"}]
[]
[]
[" "]
[null,{"$f":"A2","v":"ARTEMIA LOPEZ MONTER"}]
[null,null,{"$f":"+C2","v":{"v":8008.04,"d":"8,008.04"}}]
[null,{"$f":"+CAPTURA!C4","v":1015}]
[]
[]
[]
[]
[]
[" "]
[]
[]
[]
[]
[]
[]
[null,null,{"$f":"+C11","v":8008.04}]

{"sheet":"CHEQUE NVO","index":2,"n_rows":15,"n_cols":11,"rows_kept":15,"merged":[[0,1,0,2],[1,0,1,1],[2,0,2,3],[6,1,6,2],[7,0,7,1],[8,0,8,3],[14,0,17,3]]}
[" ",{"$f":"+CAPTURA!C5","v":"01 DE OCTUBRE DE 2018"}]
[{"$f":"+CAPTURA!C6","v":"ARTEMIA LOPEZ MONTER"},null,{"$f":"+CAPTURA!C7","v":{"v":8008.04,"d":"8,008.04"}}]
[{"$f":"PesosMN(C2)","v":"( OCHO MIL OCHO PESOS 04/100 M.N.)"}]
[" "]
[]
[" "]
[null,{"$f":"B1","v":"01 DE OCTUBRE DE 2018"}]
[{"$f":"A2","v":"ARTEMIA LOPEZ MONTER"},null,{"$f":"C2","v":{"v":8008.04,"d":"8,008.04"}}]
[{"$f":"PesosMN(C8)","v":"( OCHO MIL OCHO PESOS 04/100 M.N.)"}]
[null,"CHEQUE",{"$nulls":8}," "]
[null,{"$f":"+CAPTURA!C4","v":1015}]
[]
[]
[]
[{"$f":"+CAPTURA!C8","v":"PAGO DE RENTA DEL MES DE OCTUBRE 2018 ( SAMAPA )"}]

{"sheet":"Orden sin recibo","index":3,"n_rows":38,"n_cols":76,"rows_kept":38,"merged":[[5,10,6,10],[12,2,12,7],[16,2,16,7],[34,2,34,3],[34,5,34,7]]}
[]
[]
[]
[]
[]
[{"$nulls":3},"                                                                                          ",{"$nulls":6},"Numero de Cheque"]
[]
[{"$nulls":10},566]
[null,null,"                                           ",null," "]
[null,null,"      "]
[null,null,"                                                                                                                                                                                                                                                                                                                                                                                                                                                                                                                                                                                 "]
[null,"                                         ",{"$nulls":4},"      ",{"$f":"+VLOOKUP(F26,'REGISTRO DE CHEQUES'!A1:G4945,4,FALSE)","v":{"v":16350,"d":"16,350.00"}}]
[null,null,{"$f":"PesosMN(H12)","v":"( DIECISEIS MIL TRESCIENTOS CINCUENTA PESOS 00/100 M.N.)"}]
[null,null,"                            ",null," "]
[null,"                        ","      ","                                 "," ",null,null," "]
[]
[null,null,{"$f":"+VLOOKUP(F26,'REGISTRO DE CHEQUES'!A1:G4945,5,FALSE)","v":"PAGO DE COMBUSTIBLE DEL 11 AL 16 DE ENERO"}]
[{"$nulls":75},"Z"]
["  "]
[null,null,"            "]
[null,null,"      ",null," "]
[null,null,"     "]
[null,null,"                        "]
[null,null,"     "," "]
[null,null,"               ",null,null,"            "]
[null,null,"     ","CHEQUE",null,{"$f":"+VLOOKUP(K8,'REGISTRO DE CHEQUES'!A1:G4945,1,FALSE)","v":566}]
[{"$nulls":4}," "]
[null,null,"      "," ",null," ",null,"                                                                                                                                                                                                                                                                                                                                                                         "]
[null,null,"     "]
[null,null,"      "]
[null,null,"       "]
[null,null,"      "]
[null,null,"      ",null,null," "]
[null,null,"                                  ",{"$nulls":4}," "]
[null,null,"IXTLAHUACAN DE LOS MEMBRILLOS, JAL. ",null,null,{"$f":"+VLOOKUP(F26,'REGISTRO DE CHEQUES'!A1:G4945,2,FALSE)","v":"23 DE ENERO DE 2018"}]
[null,null,"          "]
[]
["LIC. ANTONIO COVARRUBIAS MEJIA"]

{"sheet":"orden con recibo","index":4,"n_rows":43,"n_cols":9,"rows_kept":43,"merged":[[1,8,2,8],[9,1,9,6],[14,0,14,3],[19,5,19,6],[20,5,20,6],[27,5,27,6],[28,1,28,6],[29,1,29,6],[31,3,31,6],[33,2,33,6],[35,1,35,6],[39,0,39,3],[39,4,39,5],[42,3,42,5]]}
[]
[{"$nulls":8},"Numero de Cheque"]
[]
[{"$nulls":8},566]
[]
[]
[{"$nulls":4},{"$f":"+VLOOKUP(E23,'REGISTRO DE CHEQUES'!A1:G4945,3,FALSE)","v":"JOSE VICENTE ROMERO RUIZ"}]
[]
[{"$nulls":5},{"$f":"+VLOOKUP(E23,'REGISTRO DE CHEQUES'!A1:G4945,4,FALSE)","v":{"v":16350,"d":"16,350.00"}}]
[null,{"$f":"PesosMN(F9)","v":"( DIECISEIS MIL TRESCIENTOS CINCUENTA PESOS 00/100 M.N.)"}]
[]
[{"$nulls":4},"  "]
[]
[]
["IXTLAHUACAN DE LOS MEMBRILLOS ",{"$nulls":4},{"$f":"+VLOOKUP(E23,'REGISTRO DE CHEQUES'!A1:G4945,2,FALSE)","v":"23 DE ENERO DE 2018"}]
[]
[]
[]
[]
[]
["LIC. ANTONIO COVARRUBIAS MEJIA"]
[]
[{"$nulls":4},{"$f":"+VLOOKUP(I4,'REGISTRO DE CHEQUES'!A1:G4945,1,FALSE)","v":566}]
[]
[]
[]
[{"$nulls":5},{"$f":"F9","v":{"v":16350,"d":"16,350.00"}}]
[]
[null,"IXTLAHUACAN DE LOS MEMBRILLOS, JALISCO"]
[]
[null,null," "]
[null,{"$f":"F9","v":{"v":16350,"d":"16,350.00"}},null,{"$f":"B10","v":"( DIECISEIS MIL TRESCIENTOS CINCUENTA PESOS 00/100 M.N.)"}]
[]
[]
[]
[null,{"$f":"+VLOOKUP(E23,'REGISTRO DE CHEQUES'!A1:G4945,5,FALSE)","v":"PAGO DE COMBUSTIBLE DEL 11 AL 16 DE ENERO"}]
[]
[]
[]
["IXTLAHUACAN DE LOS MEMBRILLOS",{"$nulls":3},{"$f":"+F15","v":"23 DE ENERO DE 2018"}]
["  "]
[]
[{"$nulls":3},{"$f":"E7","v":"JOSE VICENTE ROMERO RUIZ"}]

{"sheet":"PAGARE","index":5,"n_rows":9,"n_cols":13,"rows_kept":9,"merged":[[1,0,1,1],[1,4,1,9],[1,12,1,14],[2,7,2,8],[2,13,2,14],[3,2,3,10],[5,0,5,14],[8,1,8,6],[8,7,8,14],[9,1,9,9],[10,1,10,6]]}
[]
[{"$f":"+CAPTURA!C4","v":1015},{"$nulls":3},"VENCIMIENTO",{"$nulls":7},{"$f":"+CAPTURA!C7","v":{"v":8008.04,"d":"8,008.04"}}]
[]
[null,null,"SISTEMA ADMINISTRATIVO DE AGUA POTABLE Y ALCANTARILLADO "]
[]
[{"$f":"PesosMN(M2)","v":"( OCHO MIL OCHO PESOS 04/100 M.N.)"}]
[]
[]
[null,{"$f":"+CAPTURA!C6","v":"ARTEMIA LOPEZ MONTER"},{"$nulls":5},{"$f":"+CAPTURA!C5","v":"01 DE OCTUBRE DE 2018"}]

{"sheet":"REGISTRO DE CHEQUES","index":6,"n_rows":451,"n_cols":7,"rows_kept":451}
["CHEQUE","FECHA","NOMBRE","CANTIDAD","CONCEPTO","OBSERVACIONES","DEPARTAMENTO"]
[566,"23 DE ENERO DE 2018","JOSE VICENTE ROMERO RUIZ",{"v":16350,"d":"$16,350.00"},"PAGO DE COMBUSTIBLE DEL 11 AL 16 DE ENERO","PAGO DE COMBUSTIBLE DEL 11 AL 16 DE ENERO"]
[567,"23 DE ENERO DE 2018","JOSE VICENTE ROMERO RUIZ",{"v":10100,"d":"$10,100.00"},"PAGO DE COMBUSTIBLE DEL 27 DE DICIEMBRE 2017 AL 02 DE ENERO 2018"]
[568,"24 DE ENERO DE 2018","EMILIO GONZALEZ DELGADILLO",{"v":120384,"d":"$120,384.00"},"PAGO DE NOMINA PRIMER QUINCENA DE ENERO 2018","NOMINA"]
[569,"24 DE ENERO DE 2018","EMILIO GONZALEZ DELGADILLO",{"v":15081,"d":"$15,081.00"},"PAGO DE  PRIMER QUINCENA DE ENERO 2018 PERSONAL EVENTUAL","NOMINA EVENTUL"]
[570,"24 DE ENERO DE 2018","CARLOS ORTIZ ZAMORA",{"v":5000,"d":"$5,000.00"},"PRESTAMO PERSONAL A  EMPLEADO","PRESTAMO"]
[571,"25 DE ENERO DE 2018","EMILIO GONZALEZ DELGADILLO",{"v":299808,"d":"$299,808.00"},"PAGO A LA CFE POR CONCEPTO DE ENERGIA ","CFE "]
[572,"26 DE ENERO DE 2018","JOSE VICENTE ROMERO RUIZ",{"v":16650,"d":"$16,650.00"},"PAGO DE  COMBUSTIBLE DEL 18 AL 24 DE ENERO DEL 2018"]
[573,"26 DE ENERO DE 2018","EMILIO GONZALEZ DELGADILLO ",{"v":4000,"d":"$4,000.00"},"PRESTAMO PERSONAL A EMPLEADO"]
[574,"26 DE ENERO DE 2018","JORGE ANDRES MANCILLA CASTILLO",{"v":4523.88,"d":"$4,523.88"},"TONER SAMSUNG  G M4072U EXTRA ALTO REND. Y 2 TONER HEWLETT PACKARD HP-17 A ORIGINAL"]
[575,"26 DE ENERO DE 2018","FELIPE HERRERA ENCISO",{"v":5323.24,"d":"$5,323.24"},"MATERIAL PARA VACTOR , CUADRILLAS Y BOMBA DE AGUA"]
[576,"26 DE ENERO DE 2018","JUAN MIGUEL TREJO ROMERO",{"v":8120,"d":"$8,120.00"},"EXCAVACION DE LINEA DE AGUA EN FRACCIONAMIENTO OLIVOS I"]
[577,"29 DE ENERO DE 2018","CANCELADO",{"v":7500.04,"d":"$7,500.04"},"RENTA DEL MES DE ENERO 2018"]
[578,"29 DE ENERO DE 2018","CANCELADO",{"v":7500.04,"d":"$7,500.04"},"RENTA DEL MES DE ENERO 2018"]
[579,"29 DE ENERO DE 2018","CANCELADO",{"v":7500.04,"d":"$7,500.04"},"RENTA DEL MES DE ENERO 2018"]
[580,"29 DE ENERO DE 2018","ARTEMIA LOPEZ MONTER",{"v":7500.04,"d":"$7,500.04"},"RENTA DEL MES DE ENERO 2018"]
[581,"29 DE ENERO DE 2018","CANCELADO",{"v":1215911,"d":"$1,215,911.00"},"PAGO DE ENERGIA ELECTRICA DEL MES DE DICIEMBRE 2017."]
[582,"29 DE ENERO DE 2018","CANCELADO",{"v":1215911,"d":"$1,215,911.00"},"PAGO DE ENERGIA ELECTRICA DEL MES DE DICIEMBRE 2017"]
[583,"29 DE ENERO DE 2018","CANCELADO",{"v":1215911,"d":"$1,215,911.00"},"PAGO DE ENERGIA ELECTRICA DEL MES DE DICIEMBRE 2017."]
[584,"29 DE ENERO DE 2018","CFE SUMINISTRADOR DE SERVICIOS BASICOS ",{"v":1215911,"d":"$1,215,911.00"},"PAGO DE ENERGIA ELECTRICA DEL MES DE DICIEMBRE 2017"]
[585,"30 DE ENERO DE 2018","EMILIO GONZALEZ DELGADILLO",{"v":129014.8,"d":"$129,014.80"},"PAGO DE NOMINA SEGUNDA QUINCENA DE ENERO 2018"]
[586,"30 DE ENERO DE 2018","EMILIO GONZALEZ DELGADILLO",{"v":15950,"d":"$15,950.00"},"PAGO DE NOMINA SEGUNDA QUINCENA DE ENERO 2018 PERSONAL EVENTUAL"]
[587,"30 DE ENERO DE 2018","COMERCIALIZADORA INDUSTRIAL DE ZAPOPAN SA DE CV",{"v":29116,"d":"$29,116.00"},"PAGO DE CLORO REFERENCIADO EN ADEFAS 2017 QUE AMPARAN LAS FACTURAS NO. 006676E Y 006639E"]
[588,"30 DE ENERO DE 2018","COMERCIALIZADORA INDUSTRIAL DE ZAPOPAN SA DE CV",{"v":12180,"d":"$12,180.00"},"PAGO DE CLORO  REFERENCIADO EN FACTURA NO. 006863E DE FECHA 09/01/2018"]
[589,"31 DE ENERO DE 2018","EMILIO GONZALEZ DELGADILLO",{"v":10480.22,"d":"$10,480.22"},"GASTOS A COMPROBAR "]
[590,"31 DE ENERO DE 2018","ALBERTO HERNANDEZ VELAZQUEZ",{"v":293712,"d":"$293,712.00"},"TANQUE DE ACERO AL CARBON DE 1/4\"  EN LATERALES Y 3/4 \" EN BASE,  DE 5 MTS DE DIAMETRO  X 4.4 DE ALTURA,PINTADO EL INTERIOR CON PINTURA EPOXICA INCLUYE GRUA Y  TRASPORTE AL LUGAR DE LA OBRA, DE APROXIMADAMENTE 90 MIL LTS."]
[591,"31 DE ENERO DE 2018","RIVERA TORRES JESSICA MONTSERRAT",{"v":50130.04,"d":"$50,130.04"},"SUMINISTRO DE UN ARRANCADOR MARCA SIEMENS DE 75 HP/440 VOLTS, UN AUTO-TRANSFORMADOR EN SECO DE 350 KV. PARA DOTAR DE ENERGIA  A DOSIFICADOR, PASTILLA TERMICA DE 2 AMPRS. UN DETECTOR DE FALLA EN FASE INSTALACION DE PIEZAS ELECTRICAS Y PUESTO EN MARCHA. OLIVOS II"]
[592,"31 DE ENERO DE 2018","RODRIGUEZ VELASCO ALEJANDRO",{"v":2784,"d":"$2,784.00"},"CAMBIO DE ACEITE , RETEN DELANTAL DE SIGUEÑAL Y TAPON DE CARTER A VEHICULO CHEVROLET LUV, ASIGNADO AL AREA DE SAMAPA."]
[593,"01 DE  FEBRERO DE 2018","TUBERIAS Y CONEXIONES DEL LAGO",{"v":84786.65,"d":"$84,786.65"},"MATERIAL SOLICITADO PARA TRABAJOS DE LAS DIFERENTES CUADRILLAS,  SAMAPA"]
[594,"02 DE FEBRERO DE 2018","JOSE VICENTE ROMERO RUIZ",{"v":16800,"d":"$16,800.00"},"PAGO DE DE COMBUSTIBLE DEL 25 AL 31 DE ENERO 2018"]
[595,"02 DE FEBRERO DE 2018","EFRAIN ESTRADA MEJIA",{"v":1000,"d":"$1,000.00"},"APOYO A CHOFER DE PIPA DEL ESTADO"]
[596,"07 DE FEBRERO DE 2018","JESUS ALEJANDRO FLORES BERNARDO",{"v":1269,"d":"$1,269.00"},"GASTOS A COMPROBAR "]
[597,"07 DE FEBRERO DE 2018","JOSE CARLOS GUTIERREZ FLORES",{"v":4274.6,"d":"$4,274.60"},"MATERIAL DE CONSTRUCCION UTILIZADO PARA REPARAR FUGAS Y DRENAJES EN ATEQUIZA"]
[598,"07 DE FEBRERO DE 2018","ANTONIO COVARRUBIAS MEJIA",{"v":4230.23,"d":"$4,230.23"},"GASTOS A COMPROBAR"]
[599,"07 DE FEBRERO DE 2018","MAURO GOMEZ CORDOVA",{"v":11697.44,"d":"$11,697.44"},"MATERIAL UTILIZADO EN REPARACIONES VARIAS DENTRO DEL MUNICIPIO "]
[600,"07 DE FEBRERO DE 2018","FELIPE HERRERA ENCISO",{"v":1881.52,"d":"$1,881.52"},"MATERIAL UTILIZADO EN LOCALIDADES , CUADRIALLAS Y VACTOR (SAMAPA)"]
[601,"07 DE FEBRERO DE 2018","FELIPE HERRERA ENCISO",{"v":3495.08,"d":"$3,495.08"},"MATERIAL UTILIZADO EN LOCALIDADES Y CUADRIALLAS  (SAMAPA)"]
[602,"07 DE FEBRERO DE 2018","FELICIANO GARCIA PEREZ",{"v":9800,"d":"$9,800.00"},"REPARACION DE MOTO BOMBA DEL FRACCIONAMIENTO LOMAS DE LA CAPILLA."]
[603,"07 DE FEBRERO DE 2018","JORGE ANDRES MANCILLA CASTILLO",{"v":8447.73,"d":"$8,447.73"},"TONER,CARTUCHOS Y PASTAS PARA ENGARGOLAR"]
[604,"08 DE FEBRERO DE 2018","JOSE VICENTE ROMERO RUIZ",{"v":15050,"d":"$15,050.00"},"PAGO DE COMBUSTIBLE DE 01 AL 07 DE FEBRERO 2018"]
[605,"09 DE FEBRERO D 2018","TECNOELECTRICANACIONAL S.A. DE C.V.",{"v":7074.16,"d":"$7,074.16"},"CANCELADO"]
[606,"09 DE FEBRERO D 2018","TECNOELECTRICA NACIONAL S.A. DE C.V.",{"v":7074.16,"d":"$7,074.16"},"SALDO DE RAPARACION A TRANSFORMADOR MARCA CE, SERIE: 4004-4975 DE LA CAÑADA"]
[607,"CANCELADO","CANCELADO",{"v":133581,"d":"$133,581.00"},"CANCELADO"]
[608,"12 DE FEBRERO DE 2018","LUIS ENRIQUE BALVINO FLORES",{"v":3000,"d":"$3,000.00"},"PAGO DE FINIQUITO"]
[609,"15 DE FEBRERO DE 2018","EMILIO GONZALEZ DELGADILLO",{"v":133581,"d":"$133,581.00"},"PAGO DE NOMINA PRIMERA QUINCENA DE FEBRERO"]
[610,"14 DE FEBRERO DE 2018","FRANCISCO JAVIER HERRERA ENCISO",{"v":6061,"d":"$6,061.00"},"PAGO DE ADQUISICION DE REFACCIONES PARA VEHICULOS DE SAMAPA"]
[611,"16 DE FEBRERO DE E2018","JOSE VICENTE ROMERO RUIZ","16050 CANCELADO","PAGO DE COMBUSTIBLE DEL 31 DE ENERO AL 14 DE FEBRERO DE 2018","CANCELADO"]
[612,"16 DE FEBRERO DE 2018","JOSE VICENTE ROMERO RUIZ",{"v":16050,"d":"$16,050.00"},"PAGO DE COMBUSTIBLE DEL 31 DE ENERO AL 14 DE FEBRERO DE 2018"]
[613,"16 DE FEBRERO DE 2018","MARCO ANTONIO RAMIREZ BRAVO ",{"v":5220,"d":"$5,220.00"},"PAGO DE SERVICIO DE RETROEXCAVADORA, EN LA CAPILLA PARA CONEXIÓN DE DRENAJE Y EN OLIVIOS I, REPARACIONES DE FUGA DE AGUA"]
[614,"16 DE FEBRERO DE 2018","EFRAIN ESTRADA MEJIA",{"v":1000,"d":"$1,000.00"},"APOYO A CHOFER DE PIPA DEL ESTADO"]
[615,"16 DE FEBRERO DE 2018","GONZALO BEJARANO LECHUGA",{"v":2552,"d":"$2,552.00"},"IMPRESIÓN DE 1 MILLAR DE VALES DE GASOLINA Y VOLANTES  PARA SAMAPA"]
[616,"16 DE FEBRERO DE 2018","EMILIO GONZALES DELGADILLO",{"v":29839.02,"d":"$29,839.02"},"PAGO DE AGUINALDOS 2017 REFERENCIADOS EN ADEFAS"]
[617,"16 DE FEBRERO DE 2018","JOSE ANTONIO CONTRERAS LOPEZ",{"v":4500,"d":"$4,500.00"},"ESTRUCTURA METALICA EN TUBULAR DE 4\" Y PTR DE 2\" PORTA TUBOS ( EN SAMAPA)"]
[618,"16 DE FEBRERO DE 2018","EMILIO GONZALEZ DELGADILLO",{"v":7422.8,"d":"$7,422.80"},"GASTOS A COMPROBAR"]
[619,"16 DE FEBRERO DE 2018","ALEJANDRA SANCHEZ VILLASEÑOR ",{"v":1434,"d":"$1,434.00"},"PAGO POR CUBRIR VACACIONES A OPERADOR DE POZO DE LA LOCALIDAD DE VALLE DE LOS OLIVOS"]
[620,"19 DE FEBRERO DE 2018","ARTEMIA LOPEZ MONTER ",{"v":7500.04,"d":"$7,500.04"},"PAGO DE RENTA DEL MES DE FEBRERO 2018 ( SAMAPA)"]
[621,"19 DE FEBRERO DE 2018","JESUS ALEJANDRO FLORES BERNARDO",{"v":3480,"d":"$3,480.00"},"GASTOS A COMPROBAR"]
[622,"20 DE FEBRERO DE 2018","TUBERIAS Y CONEXIONES DEL LAGO SA DE CV",{"v":29616.03,"d":"$29,616.03"},"MATERIAL SOLICITADO PARA LAS DIFERENTES CUADRILLAS, SAMAPA"]
[623,"20 DE FEBRERO DE 2018","EMILIO GONZALEZ DELGADILLO",{"v":31688.88,"d":"$31,688.88"},"GASTOS A COMPROBAR"]
[624,"21 DE FEBRERO DE 2018","MARCO ANTONIO RAMIREZ BRAVO",{"v":8120,"d":"$8,120.00"},"SERV. DE RETROEXCAVADORA PARA DESAZOLVE DE SANJAS, POR DESCARGAS DE DRENAJE EN FRACCIONAMIENTO SABINOS"]
{"$rows_left_out":392}
{"sheet":"CONCEPTO DE CHEQUE CHICO","index":7,"n_rows":1,"n_cols":1,"rows_kept":1,"hidden":true}
["CONCEPTOS DE PAGO"]

{"sheet":"PROVEEDORES","index":8,"n_rows":20,"n_cols":1,"rows_kept":20}
["ARCENIO GOMEZ GUTIERREZ"]
["CFE SUMINISTRADOR DE SERVICIOS BASICOS "]
["ELECTRICA 2004 SA DE CV"]
["EMILIO GONZALEZ DELGADILLO"]
["FELICIANO GARCIA PEREZ"]
["FELIPE HERRERA ENCISO"]
["FRANCISCO JAVIER HERRERA ENCISO"]
["JESUS ALEJANDRO FLORES BERNARDO"]
["JORGE ANDRES MANCILLA CASTILLO"]
["JOSE VICENTE ROMERO RUIZ"]
["MAURO GOMEZ CORDOVA"]
["RODRIGUEZ VELASCO ALEJANDRO"]
["TUBERIAS Y CONEXIONES DEL LAGO SA DE CV"]
["SERGIO HERRERA ENCISO"]
["TECNOELECTRICA NACIONAL S.A. DE C.V."]
["CINDY CACHUA VILLA"]
["ARTEMIA LOPEZ MONTER"]
["ALBERTO HERNANDEZ VELAZQUEZ"]
["COMERCIALIZADORA INDUSTRIAL DE ZAPOPAN SA DE CV"]
["RIVERA TORRES JESSICA MONTSERRAT"]

{"sheet":"Transfer","index":9,"n_rows":38,"n_cols":76,"rows_kept":38,"merged":[[4,10,5,10],[12,2,12,7],[16,2,16,7],[34,2,34,3],[34,5,34,7]]}
[]
[]
[]
[]
[{"$nulls":3},"                                                                                          ",{"$nulls":6},"Numero de Cheque"]
[]
[{"$nulls":10},452036]
[]
[null,null,"                                           ",null," "]
[null,null,"      "]
[null,null,"                                                                                                                                                                                                                                                                                                                                                                                                                                                                                                                                                                                 "]
[null,"                                         ",{"$nulls":4},"      ",{"$f":"+VLOOKUP(F26,'REGISTRO DE CHEQUES'!A1:G4945,4,FALSE)","v":{"$error":"#N/A"}}]
[null,null,{"$f":"PesosMN(H12)","v":{"$error":"#VALUE!"}}]
[null,null,"                            ",null," "]
[null,"                        ","      ","                                 "," ",null,null," "]
[]
[null,null,{"$f":"+VLOOKUP(F26,'REGISTRO DE CHEQUES'!A1:G4945,5,FALSE)","v":{"$error":"#N/A"}}]
[{"$nulls":75},"Z"]
["  "]
[null,null,"            "]
[null,null,"      ",null," "]
[null,null,"     "]
[null,null,"                        "]
[null,null,"     "," "]
[null,null,"               ",null,null,"            "]
[null,null,"     ","Transferencia",null,{"$f":"+VLOOKUP(K7,'REGISTRO DE CHEQUES'!A1:G4945,1,FALSE)","v":{"$error":"#N/A"}}]
[{"$nulls":4}," "]
[null,null,"      "," ",null," ",null,"                                                                                                                                                                                                                                                                                                                                                                         "]
[null,null,"     "]
[null,null,"      "]
[null,null,"       "]
[null,null,"      "]
[null,null,"      ",null,null," "]
[null,null,"                                  ",{"$nulls":4}," "]
[null,null,"IXTLAHUACAN DE LOS MEMBRILLOS, JAL. ",null,null,{"$f":"+VLOOKUP(F26,'REGISTRO DE CHEQUES'!A1:G4945,2,FALSE)","v":{"$error":"#N/A"}}]
[null,null,"          "]
[]
["LIC ANTONIO COVARRUBIAS MEJIA"]

{"sheet":"Orden sin recibo TRANS","index":10,"n_rows":38,"n_cols":76,"rows_kept":38,"merged":[[5,10,6,10],[12,2,12,7],[16,2,16,7],[34,2,34,3],[34,5,34,7]]}
[]
[]
[]
[]
[]
[{"$nulls":3},"                                                                                          ",{"$nulls":6},"Numero de Cheque"]
[]
[]
[null,null,"                                           ",null," "]
[null,null,"      "]
[null,null,"                                                                                                                                                                                                                                                                                                                                                                                                                                                                                                                                                                                 "]
[null,"                                         ",{"$nulls":4},"      ",{"v":1520,"d":"1,520.00"}]
[null,null,{"$f":"PesosMN(H12)","v":"( UN MIL QUINIENTOS VEINTE PESOS 00/100 M.N.)"}]
[null,null,"                            ",null," "]
[null,"                        ","      ","                                 "," ",null,null," "]
[]
[null,null,"PAGO DE GASOLINA DEL LA SEMAN DEL 26 AL 31 DE ENERO DEL 2018"]
[{"$nulls":75},"Z"]
["  "]
[null,null,"            "]
[null,null,"      ",null," "]
[null,null,"     "]
[null,null,"                        "]
[null,null,"     "," "]
[null,null,"               ",null,null,"            "]
[null,null,"     ","TRANSFERENCIA",null,25369]
[{"$nulls":4}," "]
[null,null,"      "," ",null," ",null,"                                                                                                                                                                                                                                                                                                                                                                         "]
[null,null,"     "]
[null,null,"      "]
[null,null,"       "]
[null,null,"      "]
[null,null,"      ",null,null," "]
[null,null,"                                  ",{"$nulls":4}," "]
[null,null,"IXTLAHUACAN DE LOS MEMBRILLOS, JAL. ",null,null,"2018-02-03"]
[null,null,"          "]
[]
["LIC. ANTONIO COVARRUBIAS MEJIA"]

{"sheet":"orden con recibo MODF","index":11,"n_rows":43,"n_cols":9,"rows_kept":43,"merged":[[1,8,2,8],[9,1,9,6],[14,0,14,3],[19,5,19,6],[20,5,20,6],[27,5,27,6],[28,1,28,6],[29,1,29,6],[31,3,31,6],[33,2,33,6],[35,1,35,6],[39,0,39,3],[39,4,39,5],[42,3,42,5]]}
[]
[{"$nulls":8},"Numero de Cheque"]
[]
[]
[]
[]
[{"$nulls":4},"ALEJANDRO"]
[]
[{"$nulls":5},{"v":5220,"d":"5,220.00"}]
[null,{"$f":"PesosMN(F9)","v":"( CINCO MIL DOSCIENTOS VEINTE PESOS 00/100 M.N.)"}]
[]
[{"$nulls":4},"  "]
[]
[]
["IXTLAHUACAN DE LOS MEMBRILLOS ",{"$nulls":4},"2018-02-02"]
[]
[]
[]
[]
[]
["LIC. ANTONIO COVARRUBIAS MEJIA"]
[]
[{"$nulls":4},1234]
[]
[]
[]
[{"$nulls":5},{"$f":"F9","v":{"v":5220,"d":"5,220.00"}}]
[]
[null,"IXTLAHUACAN DE LOS MEMBRILLOS, JALISCO"]
[]
[null,null," "]
[null,{"$f":"F9","v":{"v":5220,"d":"5,220.00"}},null,{"$f":"B10","v":"( CINCO MIL DOSCIENTOS VEINTE PESOS 00/100 M.N.)"}]
[]
[]
[]
[null,"NOMINA"]
[]
[]
[]
["IXTLAHUACAN DE LOS MEMBRILLOS",{"$nulls":3},{"$f":"+F15","v":"2018-02-02"}]
["  "]
[]
[{"$nulls":3},{"$f":"E7","v":"ALEJANDRO"}]

{"sheet":"Hoja1","index":12,"n_rows":4,"n_cols":1,"rows_kept":4}
["CUANTO SE HA GASTADO"]
[]
[]
["ENERO"]

{"sheet":"Hoja2","index":13,"n_rows":41,"n_cols":1,"rows_kept":41}
["JOSE VICENTE ROMERO RUIZ"]
["CARLOS ORTIZ ZAMORA"]
["EMILIO GONZALEZ DELGADILLO "]
["JORGE ANDRES MANCILLA CASTILLO"]
["FELIPE HERRERA ENCISO"]
["JUAN MIGUEL TREJO ROMERO"]
["ARTEMIA LOPEZ MONTER"]
["CFE SUMINISTRADOR DE SERVICIOS BASICOS "]
["COMERCIALIZADORA INDUSTRIAL DE ZAPOPAN SA DE CV"]
["ALBERTO HERNANDEZ VELAZQUEZ"]
["RIVERA TORRES JESSICA MONTSERRAT"]
["RODRIGUEZ VELASCO ALEJANDRO"]
["TUBERIAS Y CONEXIONES DEL LAGO"]
["EFRAIN ESTRADA MEJIA"]
["JESUS ALEJANDRO FLORES BERNARDO"]
["JOSE CARLOS GUTIERREZ FLORES"]
["ANTONIO COVARRUBIAS MEJIA"]
["MAURO GOMEZ CORDOVA"]
["FELICIANO GARCIA PEREZ"]
["FRANCISCO JAVIER HERRERA ENCISO"]
["MARCO ANTONIO RAMIREZ BRAVO "]
["GONZALO BEJARANO LECHUGA"]
["JOSE ANTONIO CONTRERAS LOPEZ"]
["ALEJANDRA SANCHEZ VILLASEÑOR "]
["TUBERIAS Y CONEXIONES DEL LAGO SA DE CV"]
["MARCO ANTONIO RAMIREZ BRAVO"]
["ALEJANDRO RODRIGUEZ VELASCO"]
["GUILLERMO MORA ARANA"]
["SERGIO RAMOS REYES "]
["VAZQUEZ CORONA LETICIA"]
["RAFAEL CORTES HERNANDEZ"]
["APOLONIO BECERRA RAUDA"]
["TECNOELECTRICA NACIONAL SA DE CV"]
["RITA ZUÑIGA LOPEZ"]
["BENJAMIN ALMADA LEMUS "]
["MARIA ALONDRA BARRERA CONTRERAS"]
["ARCENIO GOMEZ GUTIEREZ"]
["RAUL PEREZ LAZCANO"]
["ELECTRICA 2004 SA DE CV"]
["RODRIGUEZ  VELASCO ALEJANDRO"]
["INGENIERIA EN EDIFICACIONES, CAMINOS Y ESTRUCTURAS SA DE CV"]