{"text_format":"3","workbook":"xlsx","n_sheets":14,"sheets":["CAPTURA","CHEQUE CORTO","CHEQUE NVO","Orden sin recibo","orden con recibo","PAGARE","REGISTRO DE CHEQUES","CONCEPTO DE CHEQUE CHICO","PROVEEDORES","Transfer","Orden sin recibo TRANS","orden con recibo MODF","Hoja1","Hoja2"],"not_rendered":{"macros":1,"external_links":3,"defined_names":43,"comments":2},"read":"whole","date_system":"1900"}

{"sheet":"CAPTURA","index":0,"n_rows":18,"n_cols":3,"rows_kept":18}
[]
[]
[]
[null,"CHEQUE",1516]
[null,"FECHA","2019-10-14"]
[null,"NOMBRE","EMILIO GONZALEZ DELGADILLO"]
[null,"CANTIDAD",{"v":36120.2,"d":"36,120.20"}]
[null,"CONCEPTO","COMPLEMENTO DE NOMINA CORREPONDIENTE A PRIMER QUINCENA DEL MES DE OCTUBRE DE 2019 ( PERSONAL QUE NO CUENTA CON TARJETA DE COBRO)"]
[null,"OBSERVACIONES"]
[null,"DEPARTAMENTO"]
[]
[]
[]
[]
[null,null,"                                                                      "]
[]
[]
[null,null," "]

{"sheet":"CHEQUE CORTO","index":1,"n_rows":25,"n_cols":3,"rows_kept":25,"merged":[[1,0,1,1],[2,0,2,3],[5,0,5,1],[16,0,16,1],[17,0,17,3],[20,0,20,1]]}
[" ",null,{"$f":"+CAPTURA!C5","v":"2019-10-14"}]
[{"$f":"+CAPTURA!C6","v":"EMILIO GONZALEZ DELGADILLO"},null,{"$f":"+CAPTURA!C7","v":{"v":36120.2,"d":"36,120.20"}}]
[{"$f":"PesosMN(C2)","v":"( TREINTA Y SEIS MIL CIENTO VEINTE PESOS 20/100 M.N.)"}]
[" "]
[null,"  "]
[{"$f":"+CAPTURA!C8","v":"COMPLEMENTO DE NOMINA CORREPONDIENTE A PRIMER QUINCENA DEL MES DE OCTUBRE DE 2019 ( PERSONAL QUE NO CUENTA CON TARJETA DE COBRO)"}]
[]
[]
[" "]
[null,{"$f":"A2","v":"EMILIO GONZALEZ DELGADILLO"}]
[null,null,{"$f":"+C2","v":{"v":36120.2,"d":"36,120.20"}}]
[null,{"$f":"+CAPTURA!C4","v":1516}]
[]
[]
[]
[]
[]
[" "]
[]
[]
[]
[]
[]
[]
[null,null,{"$f":"+C11","v":36120.2}]

{"sheet":"CHEQUE NVO","index":2,"n_rows":42,"n_cols":11,"rows_kept":42,"merged":[[0,1,0,2],[1,0,1,1],[2,0,2,3],[6,1,6,2],[7,0,7,1],[8,0,8,3],[14,0,16,0]]}
[null,{"$f":"+CAPTURA!C5","v":"2019-10-14"}]
[{"$f":"+CAPTURA!C6","v":"EMILIO GONZALEZ DELGADILLO"},null,{"$f":"+CAPTURA!C7","v":{"v":36120.2,"d":"36,120.20"}}]
[{"$f":"PesosMN(C2)","v":"( TREINTA Y SEIS MIL CIENTO VEINTE PESOS 20/100 M.N.)"}]
[" "]
[]
[" "]
[null,{"$f":"B1","v":"2019-10-14"}]
[{"$f":"A2","v":"EMILIO GONZALEZ DELGADILLO"},null,{"$f":"C2","v":{"v":36120.2,"d":"36,120.20"}}]
[{"$f":"PesosMN(C8)","v":"( TREINTA Y SEIS MIL CIENTO VEINTE PESOS 20/100 M.N.)"}]
[null,"CHEQUE",{"$nulls":8}," "]
[null,{"$f":"+CAPTURA!C4","v":1516}]
[]
[]
[]
[]
[]
[]
[{"$f":"+CAPTURA!C8","v":"COMPLEMENTO DE NOMINA CORREPONDIENTE A PRIMER QUINCENA DEL MES DE OCTUBRE DE 2019 ( PERSONAL QUE NO CUENTA CON TARJETA DE COBRO)"}]
{"$rows_empty":10}
[{"$f":"+A2","v":"EMILIO GONZALEZ DELGADILLO"},null,{"$f":"+C2","v":{"v":36120.2,"d":"36,120.20"}}]
{"$rows_empty":12}
[null,null,{"$f":"+C29","v":{"v":36120.2,"d":"36,120.20"}}]

{"sheet":"Orden sin recibo","index":3,"n_rows":38,"n_cols":76,"rows_kept":38,"merged":[[5,10,6,10],[12,2,12,7],[16,2,16,7],[34,2,34,3],[34,5,34,7]]}
[]
[]
[]
[]
[]
[{"$nulls":3},"                                                                                          ",{"$nulls":6},"Numero de Cheque"]
[]
[{"$nulls":10},566]
[null,null,"                                           ",null," "]
[null,null,"      "]
[null,null,"                                                                                                                                                                                                                                                                                                                                                                                                                                                                                                                                                                                 "]
[null,"                                         ",{"$nulls":4},"      ",{"$f":"+VLOOKUP(F26,'REGISTRO DE CHEQUES'!A1:G4916,4,FALSE)","v":{"$error":"#N/A"}}]
[null,null,{"$f":"PesosMN(H12)","v":{"$error":"#VALUE!"}}]
[null,null,"                            ",null," "]
[null,"                        ","      ","                                 "," ",null,null," "]
[]
[null,null,{"$f":"+VLOOKUP(F26,'REGISTRO DE CHEQUES'!A1:G4916,5,FALSE)","v":{"$error":"#N/A"}}]
[{"$nulls":75},"Z"]
["  "]
[null,null,"            "]
[null,null,"      ",null," "]
[null,null,"     "]
[null,null,"                        "]
[null,null,"     "," "]
[null,null,"               ",null,null,"            "]
[null,null,"     ","CHEQUE",null,{"$f":"+VLOOKUP(K8,'REGISTRO DE CHEQUES'!A1:G4916,1,FALSE)","v":{"$error":"#N/A"}}]
[{"$nulls":4}," "]
[null,null,"      "," ",null," ",null,"                                                                                                                                                                                                                                                                                                                                                                         "]
[null,null,"     "]
[null,null,"      "]
[null,null,"       "]
[null,null,"      "]
[null,null,"      ",null,null," "]
[null,null,"                                  ",{"$nulls":4}," "]
[null,null,"IXTLAHUACAN DE LOS MEMBRILLOS, JAL. ",null,null,{"$f":"+VLOOKUP(F26,'REGISTRO DE CHEQUES'!A1:G4916,2,FALSE)","v":{"$error":"#N/A"}}]
[null,null,"          "]
[]
["LIC. ANTONIO COVARRUBIAS MEJIA"]

{"sheet":"orden con recibo","index":4,"n_rows":43,"n_cols":9,"rows_kept":43,"merged":[[1,8,2,8],[9,1,9,6],[14,0,14,3],[19,5,19,6],[20,5,20,6],[27,5,27,6],[28,1,28,6],[29,1,29,6],[31,3,31,6],[33,2,33,6],[35,1,35,6],[39,0,39,3],[39,4,39,5],[42,3,42,5]]}
[]
[{"$nulls":8},"Numero de Cheque"]
[]
[{"$nulls":8},566]
[]
[]
[{"$nulls":4},{"$f":"+VLOOKUP(E23,'REGISTRO DE CHEQUES'!A1:G4916,3,FALSE)","v":{"$error":"#N/A"}}]
[]
[{"$nulls":5},{"$f":"+VLOOKUP(E23,'REGISTRO DE CHEQUES'!A1:G4916,4,FALSE)","v":{"$error":"#N/A"}}]
[null,{"$f":"PesosMN(F9)","v":{"$error":"#VALUE!"}}]
[]
[{"$nulls":4},"  "]
[]
[]
["IXTLAHUACAN DE LOS MEMBRILLOS ",{"$nulls":4},{"$f":"+VLOOKUP(E23,'REGISTRO DE CHEQUES'!A1:G4916,2,FALSE)","v":{"$error":"#N/A"}}]
[]
[]
[]
[]
[]
["LIC. ANTONIO COVARRUBIAS MEJIA"]
[]
[{"$nulls":4},{"$f":"+VLOOKUP(I4,'REGISTRO DE CHEQUES'!A1:G4916,1,FALSE)","v":{"$error":"#N/A"}}]
[]
[]
[]
[{"$nulls":5},{"$f":"F9","v":{"$error":"#N/A"}}]
[]
[null,"IXTLAHUACAN DE LOS MEMBRILLOS, JALISCO"]
[]
[null,null," "]
[null,{"$f":"F9","v":{"$error":"#N/A"}},null,{"$f":"B10","v":{"$error":"#VALUE!"}}]
[]
[]
[]
[null,{"$f":"+VLOOKUP(E23,'REGISTRO DE CHEQUES'!A1:G4916,5,FALSE)","v":{"$error":"#N/A"}}]
[]
[]
[]
["IXTLAHUACAN DE LOS MEMBRILLOS",{"$nulls":3},{"$f":"+F15","v":{"$error":"#N/A"}}]
{"$rows_left_out":4}
{"sheet":"PAGARE","index":5,"n_rows":11,"n_cols":15,"rows_kept":11,"merged":[[1,0,1,1],[1,4,1,9],[1,12,1,14],[2,7,2,8],[2,13,2,14],[3,2,3,10],[5,0,5,14],[7,2,7,8],[7,10,7,13],[8,1,8,6],[8,7,8,14],[9,1,9,9],[10,1,10,6]]}
[]
[{"$nulls":4},{"$f":"+CAPTURA!C4","v":1516},{"$nulls":7},{"$f":"+CAPTURA!C7","v":{"v":36120.2,"d":"36,120.20"}}]
[]
[null,null,"SISTEMA ADMINISTRATIVO DE AGUA POTABLE Y ALCANTARILLADO "]
[]
[{"$f":"PesosMN(M2)","v":"( TREINTA Y SEIS MIL CIENTO VEINTE PESOS 20/100 M.N.)"}]
[]
[null,null,"IXTLAHUACAN DE LOS MEMBRILLOS ",{"$nulls":6},{"$f":"+DAY(CAPTURA!C5)","v":14},{"$f":"TEXT(CAPTURA!C5,\"MMMM\")","v":"octubre"},{"$nulls":3},{"$f":"+YEAR(CAPTURA!C5)","v":2019}]
[null,{"$f":"+CAPTURA!C6","v":"EMILIO GONZALEZ DELGADILLO"}]
[null,{"$f":"+CAPTURA!C9","v":0}]
[null,{"$f":"+CAPTURA!C10","v":0}]

{"sheet":"REGISTRO DE CHEQUES","index":6,"n_rows":614,"n_cols":7,"rows_kept":614}
[null,"FECHA","NOMBRE","CANTIDAD","CONCEPTO","OBSERVACIONES","DEPARTAMENTO"]
[1152,"09 DE ENERO DE 2019","ALEJANDRO MARIA LAZCANO",{"v":1000,"d":"$1,000.00"},"PRESTAMO PERSONAL EMPLEADO (SAMAPA)"]
[1153,"09 DE ENERO DE 2019","JOSE MANUEL SANCHES TEUTLE",{"v":3000,"d":"$3,000.00"},"PRESTAMO PERSONAL A  EMPLEADO (SAMAPA)"]
[1154,"09 DE ENERO DE 2019","MIGUEL GUTIERREZ LOZANO",{"v":4500,"d":"$4,500.00"},"DEPOSITO Y 2 MESES DE RENTA DE LOCAL PARA OFICINA SAMAPA EN LA LOCALIDAD LA CAPILLA"]
[1155,"09 DE ENERO DE 2019","JOSE ANTONIO CONTRERAS LOPEZ",{"v":800,"d":"$800.00"},"TRABAJO DE SOLDADURA EN TUBO DE LINEA DE AGUA DE POZO BUENAVISTA-CEDROS"]
[1156,"09 DE ENERO DE 2019","JOSE ANTONIO CONTRERAS LOPEZ",{"v":1840,"d":"$1,840.00"},"TRABAJO DE SOLDADURA EN TUBO DE DRENAJE QUE PASA DEBAJO DEL PUENTE DE CALLE JAVIER MINA EN IXTLAHUACAN"]
[1157,"09 DE ENERO DE 2019","CESAR EUGENIO BLANCARTE MENDEZ",{"v":1800,"d":"$1,800.00"},"14 MTS CUBICOS  DE JAL PARA REPARACION DE FUGAS EN LA LOCALIDAD DE BUENAVISTA"]
[1158,"09 DE ENERO DE 2019","EMILIO GONZALEZ DELGADILLO",{"v":6000,"d":"$6,000.00"},"PRESTAMO PERSONAL A EMPLEADO SAMAPA"]
[1159,"10 DE ENERO DE 2019","EMILIO GONZALEZ DELGADILLO","CANCELADO","PRESTAMO PERSONAL A EMPLEADO SAMAPA"]
[1160,"10 DE ENERO DE 2019","EMILIO GONZALEZ DELGADILLO",{"v":1719.8,"d":"$1,719.80"},"GASTOS A COMPROBAR (ACCESORIOS PARA VEHICULO FORD AZUL ASIGNADO A SAMAPA)"]
[1161,"11 DE ENERO DE 2019","JOSE RAMON MENDEZ GUTIERREZ",{"v":3000,"d":"$3,000.00"},"PRESTAMO PERSONAL A EMPLEADO SAMAPA"]
[1162,"11 DE ENERO DE 2019","EMILIO GONZALEZ DELGADILLO",{"v":5400.1,"d":"$5,400.10"},"GASTOS A COMPROBAR ( PAPELERIA Y ACCESORIOS PARA OFICINAS SAMAPA)"]
[1163,"11 DE ENERO DE 2019","JESUS ALEJANDRO FLORES BERNARDO",{"v":921,"d":"$921.00"},"GASTOS A COMPROBAR ( HERRAMIENTAS PARA CUADRILLA SAMAPA)"]
[1164,"11 DE ENERO DE 2019","JESUS ALEJANDRO FLORES BERNARDO",{"v":1043.97,"d":"$1,043.97"},"GASTOS A COMPROBAR FACTURAS REFERIDAS EN ADEFAS 2018 (  PAPELERIA PARA OFICINAS SAMAPA)"]
[1165,"11 DE ENERO DE 2019","TUBERIAS Y CONEXIONES DEL LAGO SA DE CV",{"v":13802.16,"d":"$13,802.16"},"FACTURA REFERIDA EN ADEFAS 2018 CON FOLIO # 5626 ( MATERIAL SOLICITADO PARA ALMACEN Y CUDRILLAS SAMAPA)"]
[1166,"11 DE ENERO DE 2019","IRENE CERVANTES MANDUJANO",{"v":17719,"d":"$17,719.00"},"FACTURA REFERIDA EN ADEFAS 2018 CON FOLIO # 12244 ( 3,250 KGM DE HIPOCLORITO DE SODIO AL 13 % PARA LAS DIFRENTES FUENTES DE ABASTECIMIENTO DE AGUA POTABLE DEL MUNICIPIO )"]
[1167,"11 DE ENERO DE 2019","PAULINA AGUILAR ENCISO",{"v":4000,"d":"$4,000.00"},"PRESTAMO PERSONAL A EMPLEADO SAMAPA"]
[1168,"11 DE ENERO DE 2019","JORGE ANDRES MANCILLA CASTILLO",{"v":7398.39,"d":"$7,398.39"},"2 TONER, 1 FRASCO DE TINTA Y DERVICIO TECNICO DE MANTENIMIENTO A 2 IMPRESORAS"]
[1169,"14 DE ENERO DE 2019","JESUS ALEJANDRO FLORES BERNARDO",{"v":13420.2,"d":"$13,420.20"},"COMPLEMENTO DE NOMINA CORRESPONDIENTE A PRIMER QUINCENA DE ENERO 2019 ( PERSONAL QUE NO CUENTA CON TARJETA DE COBRO)"]
[1170,"14 DE ENERO DE 2019","JESUS ALEJANDRO FLORES BERNARDO","CANCELADO","COMPLEMENTO DE NOMINA CORRESPONDIENTE A PRIMER QUINCENA DE ENERO 2019 ( PERSONAL QUE NO CUENTA CON TARJETA DE COBRO)"]
[1171,"15 DE ENERO DE 2019","ALBERTO HERNANDEZ VELAZQUEZ",{"v":28420,"d":"$28,420.00"},"175 METROS DE CABLE SUMERGIBLE PARA POZO 1 PROFUNDO DE LA LOCALIDA DE LA CAPILLA"]
[1172,"15 DE ENERO DE 2019","EMILIO GONZALEZ DELGADILLO",{"v":2800,"d":"$2,800.00"},"GASTOS A COMPROBAR ( 4 LATAS DE ACEITE HIDRAULICO MEXLUB, PARA PERFORACION DE POZO EN LA LOCALIDAD DE LAS AGUILILLAS"]
[1173,"15 DE ENERO DE 2019","EMILIO GONZALEZ DELGADILLO",{"v":402.04,"d":"$402.04"},"GASTOS A COMPROBAR ( CONEXIÓN PRENSADA MACHO DE 1\" NTP PARA CAMION TIPO VACTOR)"]
[1174,"15 DE ENERO DE 2019","CLAUDIA DEL CARMEN SANCHEZ GARCIA",{"v":1500,"d":"$1,500.00"},"PAGO A PERSONA DE LABORES DE REQUERIMIENTO, 1ra. QUINCENA DE ENERO 2019"]
[1175,"15 DE ENERO DE 2019","JOSE CARLOS ALVAREZ NAJAR",{"v":2000,"d":"$2,000.00"},"PAGO A OPERADOR DE PTAR OLIVOS I, CORRESPONDIENTE A PRIMER QUINCENA DE ENERO 2019"]
[1176,"15 DE ENERO DE 2019","ELICEO GOMEZ PELESTOR",{"v":750,"d":"$750.00"},"CAMARA Y CORBATA PARA CAMION TIPO VACTOR"]
[1177,"18 DE ENERO DE 2019","FRANCISCO JAVIER HERRERA ENCISO",{"v":2152.96,"d":"$2,152.96"},"ACEITES Y ACCESORIOS PARA VEHICULOS SAMAPA"]
[1178,"18 DE ENERO DE 2019","SERGIO HERRERA ENCISO",{"v":16654.12,"d":"$16,654.12"},"MATERIAL SOLICITADO PARA ALMACEN Y LAS DIFERENTES CUADRILLAS SAMAPA"]
[1179,"18 DE ENERO DE 2019","FRANCISCO CORTES SANDOVAL",{"v":12200,"d":"$12,200.00"},"1 DESBROZADORA Y HERRAMIENTAS MANUALES DE JARDINERIA AGRICULTURA Y FORESTACION PARA CUADRILLAS SAMAPA"]
[1180,"21 DE ENERO DE 2019","JORGE ANDRES MANCILLA CASTILLO",{"v":17214.32,"d":"$17,214.32"},"TINTAS PARA LAS DIFERENTES IMPRESORAS DE OFICINAS SAMAPA, TARJETEROS METALICOS PARA TARJETAS CHECADORAS, TARJETAS Y RELOJ ELECTRONICO AMANO PARA CHECAR."]
[1181,"21 DE ENERO DE 2019","JOSE ROBERTO NAVARRO LAZCANO",{"v":4000,"d":"$4,000.00"},"PRESTAMO PERSONAL A EMPLEADO SAMAPA"]
[1182,"22 DE ENERO DE 2019","CFE SUMINISTRADOR DE SERVICIOS BASICOS ",{"v":2700000,"d":"$2,700,000.00"},"PAGO DE ENERGIA ELECTRICA CORRESPONDIENTE AL MES DE NOVIEMBRE Y DICIEMBRE 2018 "]
[1183,"22 DE ENERO DE 2019","JORGE ANDRES MANCILLA CASTILLO",{"v":3364,"d":"$3,364.00"},"2 TONER SAMSUNG G M4072U EXTRA ALTO REND, PARA IMPRESORAS DE OFICINAS SAMAPA"]
[1184,"22 DE ENERO DE 2019","EMILIO GONZALEZ DELGADILLO",{"v":10495.15,"d":"$10,495.15"},"GASTOS A COMPROBAR ( COMBUSTIBLE PARA VEHICULOS ASIGNADOS A SAMAPA)"]
[1185,"22 DE ENERO DE 2019","MARCO ANTONIO RAMIREZ BRAVO",{"v":6264,"d":"$6,264.00"},"12 HORAS DE SERVICIO DE RETROEXCAVADORA PARA  CONEXIÓN DE LINEA DE AGUA LA CAPILLA"]
[1186,"22 DE ENERO DE 2019","JESUS ALEJANDRO FLORES BERNARDO",{"v":1199.02,"d":"$1,199.02"},"GASTOS A COMPROBAR ( PAGO DE TELEFONIA POR CABLE E INTERNET) CORRESPONDIENTE AL MES DE ENERO 2019"]
[1187,"22 DE ENERO DE 2019","JESUS ALEJANDRO FLORES BERNARDO",{"v":800,"d":"$800.00"},"GASTOS A COMPROBAR ( AMORTUGUADOR TRASERO Y PORTA SPROCK  DE MOTOCICLETA ASIGNADA A SAMAPA)"]
[1188,"22 DE ENERO DE 2019","EMILIO GONZALEZ DELGADILLO",{"v":464,"d":"$464.00"},"GASTOS A COMPROBAR ( ACCESORIO PARA VACTOR)"]
[1189,"23 DE ENERO DE 2019","AUTOS QUE INZPIRAN S.A. DE C.V. ",{"v":189000,"d":"$189,000.00"},"ADQUISICIÓN DE VEHICULO NISSAN ESTAQUITAS MOD. 2014 PARA CUADRILLAS SAMAPA"]
[1190,"23 DE ENERO DE 2019","JORGE ANDRES MANCILLA CASTILLO",{"v":892.78,"d":"$892.78"},"TONER SAMSUNG G M-2875 ALTO RENDIMIENTO "]
{"$rows_left_out":327}
{"sheet":"CONCEPTO DE CHEQUE CHICO","index":7,"n_rows":1,"n_cols":1,"rows_kept":1,"hidden":true}
["CONCEPTOS DE PAGO"]

{"sheet":"PROVEEDORES","index":8,"n_rows":26,"n_cols":1,"rows_kept":26}
["ARCENIO GOMEZ GUTIERREZ"]
["CFE SUMINISTRADOR DE SERVICIOS BASICOS "]
["ELECTRICA 2004 SA DE CV"]
["EMILIO GONZALEZ DELGADILLO"]
["FELICIANO GARCIA PEREZ"]
["FELIPE HERRERA ENCISO"]
["FRANCISCO JAVIER HERRERA ENCISO"]
["JOSE AGUSTIN JIMENEZ GUERRERO"]
["JESUS ALEJANDRO FLORES BERNARDO"]
["JORGE ANDRES MANCILLA CASTILLO"]
["JOSE VICENTE ROMERO RUIZ"]
["MAURO GOMEZ CORDOVA"]
["RODRIGUEZ VELASCO ALEJANDRO"]
["TUBERIAS Y CONEXIONES DEL LAGO SA DE CV"]
["SERGIO HERRERA ENCISO"]
["SERVICIOS Y PRODUCTOS PRODEC S.A. DE C.V."]
["TECNOELECTRICA NACIONAL S.A. DE C.V."]
["CINDY CACHUA VILLA"]
["ARTEMIA LOPEZ MONTER"]
["ALBERTO HERNANDEZ VELAZQUEZ"]
["COMERCIALIZADORA INDUSTRIAL DE ZAPOPAN SA DE CV"]
["RIVERA TORRES JESSICA MONTSERRAT"]
["TELEFONIA POR CABLE SA DE CV"]
["IRENE CERVANTES MANDUJANO"]
["MARCELO MARTINEZ NOLASCO"]
["LAMAS INFANTE GUILLERMO"]

{"sheet":"Transfer","index":9,"n_rows":38,"n_cols":76,"rows_kept":38,"merged":[[4,10,5,10],[12,2,12,7],[16,2,16,7],[34,2,34,3],[34,5,34,7]]}
[]
[]
[]
[]
[{"$nulls":3},"                                                                                          ",{"$nulls":6},"Numero de Cheque"]
[]
[{"$nulls":10},452036]
[]
[null,null,"                                           ",null," "]
[null,null,"      "]
[null,null,"                                                                                                                                                                                                                                                                                                                                                                                                                                                                                                                                                                                 "]
[null,"                                         ",{"$nulls":4},"      ",{"$f":"+VLOOKUP(F26,'REGISTRO DE CHEQUES'!A1:G4916,4,FALSE)","v":{"$error":"#N/A"}}]
[null,null,{"$f":"PesosMN(H12)","v":{"$error":"#VALUE!"}}]
[null,null,"                            ",null," "]
[null,"                        ","      ","                                 "," ",null,null," "]
[]
[null,null,{"$f":"+VLOOKUP(F26,'REGISTRO DE CHEQUES'!A1:G4916,5,FALSE)","v":{"$error":"#N/A"}}]
[{"$nulls":75},"Z"]
["  "]
[null,null,"            "]
[null,null,"      ",null," "]
[null,null,"     "]
[null,null,"                        "]
[null,null,"     "," "]
[null,null,"               ",null,null,"            "]
[null,null,"     ","Transferencia",null,{"$f":"+VLOOKUP(K7,'REGISTRO DE CHEQUES'!A1:G4916,1,FALSE)","v":{"$error":"#N/A"}}]
[{"$nulls":4}," "]
[null,null,"      "," ",null," ",null,"                                                                                                                                                                                                                                                                                                                                                                         "]
[null,null,"     "]
[null,null,"      "]
[null,null,"       "]
[null,null,"      "]
[null,null,"      ",null,null," "]
[null,null,"                                  ",{"$nulls":4}," "]
[null,null,"IXTLAHUACAN DE LOS MEMBRILLOS, JAL. ",null,null,{"$f":"+VLOOKUP(F26,'REGISTRO DE CHEQUES'!A1:G4916,2,FALSE)","v":{"$error":"#N/A"}}]
[null,null,"          "]
[]
["LIC ANTONIO COVARRUBIAS MEJIA"]

{"sheet":"Orden sin recibo TRANS","index":10,"n_rows":38,"n_cols":76,"rows_kept":38,"merged":[[5,10,6,10],[12,2,12,7],[16,2,16,7],[34,2,34,3],[34,5,34,7]]}
[]
[]
[]
[]
[]
[{"$nulls":3},"                                                                                          ",{"$nulls":6},"Numero de Cheque"]
[]
[]
[null,null,"                                           ",null," "]
[null,null,"      "]
[null,null,"                                                                                                                                                                                                                                                                                                                                                                                                                                                                                                                                                                                 "]
[null,"                                         ",{"$nulls":4},"      ",{"v":1520,"d":"1,520.00"}]
[null,null,{"$f":"PesosMN(H12)","v":"( UN MIL QUINIENTOS VEINTE PESOS 00/100 M.N.)"}]
[null,null,"                            ",null," "]
[null,"                        ","      ","                                 "," ",null,null," "]
[]
[null,null,"PAGO DE GASOLINA DEL LA SEMAN DEL 26 AL 31 DE ENERO DEL 2018"]
[{"$nulls":75},"Z"]
["  "]
[null,null,"            "]
[null,null,"      ",null," "]
[null,null,"     "]
[null,null,"                        "]
[null,null,"     "," "]
[null,null,"               ",null,null,"            "]
[null,null,"     ","TRANSFERENCIA",null,25369]
[{"$nulls":4}," "]
[null,null,"      "," ",null," ",null,"                                                                                                                                                                                                                                                                                                                                                                         "]
[null,null,"     "]
[null,null,"      "]
[null,null,"       "]
[null,null,"      "]
[null,null,"      ",null,null," "]
[null,null,"                                  ",{"$nulls":4}," "]
[null,null,"IXTLAHUACAN DE LOS MEMBRILLOS, JAL. ",null,null,"2018-02-03"]
[null,null,"          "]
[]
["LIC. ANTONIO COVARRUBIAS MEJIA"]

{"sheet":"orden con recibo MODF","index":11,"n_rows":43,"n_cols":9,"rows_kept":43,"merged":[[1,8,2,8],[9,1,9,6],[14,0,14,3],[19,5,19,6],[20,5,20,6],[27,5,27,6],[28,1,28,6],[29,1,29,6],[31,3,31,6],[33,2,33,6],[35,1,35,6],[39,0,39,3],[39,4,39,5],[42,3,42,5]]}
[]
[{"$nulls":8},"Numero de Cheque"]
[]
[]
[]
[]
[{"$nulls":4},"ALEJANDRO"]
[]
[{"$nulls":5},{"v":5220,"d":"5,220.00"}]
[null,{"$f":"PesosMN(F9)","v":"( CINCO MIL DOSCIENTOS VEINTE PESOS 00/100 M.N.)"}]
[]
[{"$nulls":4},"  "]
[]
[]
["IXTLAHUACAN DE LOS MEMBRILLOS ",{"$nulls":4},"2018-02-02"]
[]
[]
[]
[]
[]
["LIC. ANTONIO COVARRUBIAS MEJIA"]
[]
[{"$nulls":4},1234]
[]
[]
[]
[{"$nulls":5},{"$f":"F9","v":{"v":5220,"d":"5,220.00"}}]
[]
[null,"IXTLAHUACAN DE LOS MEMBRILLOS, JALISCO"]
[]
[null,null," "]
[null,{"$f":"F9","v":{"v":5220,"d":"5,220.00"}},null,{"$f":"B10","v":"( CINCO MIL DOSCIENTOS VEINTE PESOS 00/100 M.N.)"}]
[]
[]
[]
[null,"NOMINA"]
[]
[]
[]
["IXTLAHUACAN DE LOS MEMBRILLOS",{"$nulls":3},{"$f":"+F15","v":"2018-02-02"}]
{"$rows_left_out":4}
{"sheet":"Hoja1","index":12,"n_rows":4,"n_cols":1,"rows_kept":4}
["CUANTO SE HA GASTADO"]
[]
[]
["ENERO"]

{"sheet":"Hoja2","index":13,"n_rows":41,"n_cols":1,"rows_kept":41}
["JOSE VICENTE ROMERO RUIZ"]
["CARLOS ORTIZ ZAMORA"]
["EMILIO GONZALEZ DELGADILLO "]
["JORGE ANDRES MANCILLA CASTILLO"]
["FELIPE HERRERA ENCISO"]
["JUAN MIGUEL TREJO ROMERO"]
["ARTEMIA LOPEZ MONTER"]
["CFE SUMINISTRADOR DE SERVICIOS BASICOS "]
["COMERCIALIZADORA INDUSTRIAL DE ZAPOPAN SA DE CV"]
["ALBERTO HERNANDEZ VELAZQUEZ"]
["RIVERA TORRES JESSICA MONTSERRAT"]
["RODRIGUEZ VELASCO ALEJANDRO"]
["TUBERIAS Y CONEXIONES DEL LAGO"]
["EFRAIN ESTRADA MEJIA"]
["JESUS ALEJANDRO FLORES BERNARDO"]
["JOSE CARLOS GUTIERREZ FLORES"]
["ANTONIO COVARRUBIAS MEJIA"]
["MAURO GOMEZ CORDOVA"]
["FELICIANO GARCIA PEREZ"]
["FRANCISCO JAVIER HERRERA ENCISO"]
["MARCO ANTONIO RAMIREZ BRAVO "]
["GONZALO BEJARANO LECHUGA"]
["JOSE ANTONIO CONTRERAS LOPEZ"]
["ALEJANDRA SANCHEZ VILLASEÑOR "]
["TUBERIAS Y CONEXIONES DEL LAGO SA DE CV"]
["MARCO ANTONIO RAMIREZ BRAVO"]
["ALEJANDRO RODRIGUEZ VELASCO"]
["GUILLERMO MORA ARANA"]
["SERGIO RAMOS REYES "]
["VAZQUEZ CORONA LETICIA"]
["RAFAEL CORTES HERNANDEZ"]
["APOLONIO BECERRA RAUDA"]
["TECNOELECTRICA NACIONAL SA DE CV"]
["RITA ZUÑIGA LOPEZ"]
["BENJAMIN ALMADA LEMUS "]
["MARIA ALONDRA BARRERA CONTRERAS"]
["ARCENIO GOMEZ GUTIEREZ"]
["RAUL PEREZ LAZCANO"]
["ELECTRICA 2004 SA DE CV"]
["RODRIGUEZ  VELASCO ALEJANDRO"]
{"$rows_left_out":1}